{"text_format":"1","workbook":"xlsx","n_sheets":7,"sheets":["Instructions","Dashboard","TT","Backend","Data In","Data Out","Settings"],"not_rendered":{"charts":1,"images":9,"macros":1,"external_links":0,"defined_names":93,"comments":0,"pivot_tables":0},"unopened":[],"bounds":{"document_bytes":16777216,"sheet_cells":100000,"rows_first":2000,"rows_last":500,"rows_between":2000,"halvings":0,"cell_chars":16384,"cell_head_chars":4096},"cells_cut":0,"cells_raw":0,"read":"whole","date_system":"1900"}

{"sheet":"Instructions","index":0,"n_rows":4,"n_cols":3,"rows_kept":4,"cut":false,"hidden":false,"merged":[[1,1,1,3]]}
[null,"v. 210714"]
[null,{"$f":"TT!$O$3","v":"Select Language"}]
[]
[null,null,"English"]

{"sheet":"Dashboard","index":1,"n_rows":31,"n_cols":39,"rows_kept":31,"cut":false,"hidden":false,"merged":[[8,43,8,44],[1,2,1,39],[5,4,5,6],[4,11,4,12],[14,5,15,6],[6,5,7,5],[3,5,3,7],[3,9,3,14],[3,15,3,17],[3,18,3,20],[3,21,3,23],[3,24,3,26],[3,27,3,29],[3,30,3,32],[3,33,3,35],[3,36,3,38],[17,5,17,7],[13,4,13,7],[11,5,12,7],[8,25,9,25],[8,22,9,22],[16,16,17,16],[16,22,17,22],[12,22,13,22],[16,25,17,25],[12,25,13,25],[25,10,25,11],[29,10,29,11],[8,19,9,19],[9,10,9,11],[13,10,13,11],[17,10,17,11],[21,10,21,11],[24,16,25,16],[28,16,29,16],[28,19,29,19],[24,19,25,19],[20,19,21,19],[16,19,17,19],[12,19,13,19],[8,16,9,16],[12,16,13,16],[28,37,29,37],[24,37,25,37],[24,34,25,34],[24,31,25,31],[24,28,25,28],[28,34,29,34],[20,16,21,16],[28,22,29,22],[28,25,29,25],[28,28,29,28],[28,31,29,31],[24,22,25,22],[20,22,21,22],[24,25,25,25],[20,25,21,25],[20,37,21,37],[16,37,17,37],[12,37,13,37],[8,37,9,37],[20,28,21,28],[20,31,21,31],[20,34,21,34],[16,34,17,34],[16,31,17,31],[16,28,17,28],[12,28,13,28],[12,31,13,31],[12,34,13,34],[8,34,9,34],[8,31,9,31],[8,28,9,28]]}
[1,null,null,null,null,null,null,null,null,{"$f":"IF(ProgRunning=TRUE,'Data In'!B5+1,9)","v":9},null,null,null,null,null,1,1,1,2,2,2,3,3,3,4,4,4,5,5,5,6,6,6,7,7,7,8,8,8]
[{"$f":"RIGHT(CELL(\"filename\",A2),LEN(CELL(\"filename\",A2))-FIND(\"]\",CELL(\"filename\",A2)))","v":"Dashboard"},null,{"$f":"TT!$O$8","v":"Control Board"}]
[]
[null,null,null,null,null,null,null,null,null,null,null,null,null,null,null,{"$f":"TT!$O$24","v":"Column A"},null,null,{"$f":"TT!$O$25","v":"Column B"},null,null,{"$f":"TT!$O$26","v":"Column C"},null,null,{"$f":"TT!$O$27","v":"Column D"},null,null,{"$f":"TT!$O$28","v":"Column E"},null,null,{"$f":"TT!$O$29","v":"Column F"},null,null,{"$f":"TT!$O$30","v":"Column G"},null,null,{"$f":"TT!$O$31","v":"Column H"}]
[null,null,null,null,null,null,null,null,null,null,null,null,null,null,{"$f":"TT!$O$37","v":"Brightness"}]
[null,null,null,null,{"$f":"TT!$O$9","v":"Click to add active lights:"},null,null,null,null,null,null,null,null,null,{"$f":"TT!$O$38","v":"Speed"}]
[null,null,null,null,null,5]
[null,1]
{"$rows_left_out":24}
{"sheet":"TT","index":2,"n_rows":62,"n_cols":20,"rows_kept":62,"cut":false,"hidden":true,"merged":[]}
[]
[null,"Row","Tab","Location","Language 1","Language 2","Language 3","Language 4","Language 5","Language 6","Language 7","Language 8","Language 9","Language 10","Display"]
[null,{"$f":"ROW()","v":3},null,{"$f":"TT[[#This Row],[Tab]]&TT[[#This Row],[Row]]","v":"3"},"Select Language","Selecionar Idioma","Seleccionar Idioma",null,null,null,null,null,null,null,{"$f":"INDEX(TT[[#This Row],[Language 1]:[Language 10]],1,LangSelect)","v":"Select Language"},null,null,"Select Language",{"$f":"Instructions!C4","v":"English"},{"$f":"INDEX($R$5:$R$14,MATCH($S$3,$S$5:$S$14,0))","v":1}]
[null,{"$f":"ROW()","v":4},null,{"$f":"TT[[#This Row],[Tab]]&TT[[#This Row],[Row]]","v":"4"},"This workbook uses \"Macros\" (automated Excel commands) to assist in the data collection process","Esta pasta de trabalho usa \"Macros\" (comandos automatizados do Excel) para auxiliar no processo de coleta de dados","Este cuaderno utiliza \"Macros\" (comandos automatizados de Excel) para ayudar en el proceso de recolección de datos",null,null,null,null,null,null,null,{"$f":"INDEX(TT[[#This Row],[Language 1]:[Language 10]],1,LangSelect)","v":"This workbook uses \"Macros\" (automated Excel commands) to assist in the data collection process"}]
[null,{"$f":"ROW()","v":5},null,{"$f":"TT[[#This Row],[Tab]]&TT[[#This Row],[Row]]","v":"5"},"To use these Macros and have buttons on the spreadsheets work, you must \"Enable\" the Macros","Para usar essas Macros e ter botões nas planilhas funcionando, você deve \"Habilitar\" as Macros","Para utilizar estas macros y hacer que funcionen los botones en las hojas de cálculo, debes \"Habilitar\" las Macros",null,null,null,null,null,null,null,{"$f":"INDEX(TT[[#This Row],[Language 1]:[Language 10]],1,LangSelect)","v":"To use these Macros and have buttons on the spreadsheets work, you must \"Enable\" the Macros"},null,null,1,"English"]
[null,{"$f":"ROW()","v":6},null,{"$f":"TT[[#This Row],[Tab]]&TT[[#This Row],[Row]]","v":"6"},"Click the \"Enable Content\" button that appears above when you first open this workbook","Clique no botão \"Habilitar Conteúdo\" exibido acima quando você abrir a pasta de trabalho pela primeira vez","Haz clic en el botón \"Habilitar Contenido\" que aparece en la parte superior cuando abres este cuaderno de ejercicios por primera vez",null,null,null,null,null,null,null,{"$f":"INDEX(TT[[#This Row],[Language 1]:[Language 10]],1,LangSelect)","v":"Click the \"Enable Content\" button that appears above when you first open this workbook"},null,null,2,"Português"]
[null,{"$f":"ROW()","v":7},null,{"$f":"TT[[#This Row],[Tab]]&TT[[#This Row],[Row]]","v":"7"},"Once you have enabled macros, you can use the workbook.  If you do not see this message, macros are enabled","Depois de habilitar as macros, você poderá usar a pasta de trabalho.  Se você não vê essa mensagem, as macros estão habilitadas","Una vez que hayas habilitado las macros, puedes utilizar el cuaderno de ejercicios. Si no ves este mensaje, las macros están habilitadas",null,null,null,null,null,null,null,{"$f":"INDEX(TT[[#This Row],[Language 1]:[Language 10]],1,LangSelect)","v":"Once you have enabled macros, you can use the workbook.  If you do not see this message, macros are enabled"},null,null,3,"Español"]
[null,{"$f":"ROW()","v":8},null,{"$f":"TT[[#This Row],[Tab]]&TT[[#This Row],[Row]]","v":"8"},"Control Board","Tablero de Control","Painel de Controle",null,null,null,null,null,null,null,{"$f":"INDEX(TT[[#This Row],[Language 1]:[Language 10]],1,LangSelect)","v":"Control Board"},null,null,4]
{"$rows_left_out":55}
{"sheet":"Backend","index":3,"n_rows":154,"n_cols":53,"rows_kept":154,"cut":false,"hidden":true,"merged":[]}
[{"$f":"RIGHT(CELL(\"filename\",A1),LEN(CELL(\"filename\",A1))-FIND(\"]\",CELL(\"filename\",A1)))","v":"Backend"}]
[null,"LineID","Pattern","Combo","Intensity","Speed","Light1","Light2","Light3","Light4","Light5","Light6","DecString","HexString","Old String","String to Board",null,null,null,null,null,"Row","Intensity","Speed","InitDecString","EndofDecString","DecString","HexString",null,"Color","Num",null,"Light","P0Saved","P0","1L_P1","1L_P2","1L_P3","2L_P1","2L_P2","2L_P3","3L_P1","3L_P2","3L_P3","4L_P1","4L_P2","4L_P3","5L_P1","5L_P2","5L_P3","6L_P1","6L_P2","6L_P3"]
[null,{"$f":"BackendTable[[#This Row],[Pattern]]&\"_\"&BackendTable[[#This Row],[Combo]]","v":"P0_1"},"P0",1,3,1,1,1,0,0,1,0,{"$f":"DEC2BIN(BackendTable[[#This Row],[Intensity]],2)&DEC2BIN(BackendTable[[#This Row],[Speed]],2)&_xlfn.CONCAT(BackendTable[[#This Row],[Light1]:[Light6]])","v":"1101110010"},{"$f":"BIN2HEX(VALUE(MID(BackendTable[[#This Row],[DecString]],1,2)))&BIN2HEX(VALUE(MID(BackendTable[[#This Row],[DecString]],3,4)))&BIN2HEX(VALUE(MID(BackendTable[[#This Row],[DecString]],7,4)))","v":"372"},{"$f":"BackendTable[[#This Row],[Intensity]]&\";\"&BackendTable[[#This Row],[Speed]]&\";\"&BackendTable[[#This Row],[Light1]]&\";\"&BackendTable[[#This Row],[Light2]]&\";\"&BackendTable[[#This Row],[Light3]]&\";\"&BackendTable[[#This Row],[Light4]]&\";\"&BackendTable[[#This Row],[Light5]]&\";\"&BackendTable[[#This Row],[Light6]]","v":"3;1;1;1;0;0;1;0"},{"$f":"BackendTable[[#This Row],[HexString]]","v":"372"},null,"Pattern",0,null,null,1,{"$f":"INDEX(INDIRECT(\"BackendTable[\"&W$2&\"]\",0),MATCH(PatternSelect&\"_\"&RIGHT(Table_ShowIS[[#This Row],[Row]],1),BackendTable[LineID],0))","v":3},{"$f":"INDEX(INDIRECT(\"BackendTable[\"&X$2&\"]\",0),MATCH(PatternSelect&\"_\"&RIGHT(Table_ShowIS[[#This Row],[Row]],1),BackendTable[LineID],0))","v":1},{"$f":"INDEX(BackendTable[DecString],MATCH(PatternSelect&\"_\"&Table_ShowIS[[#This Row],[Row]],BackendTable[LineID],0))","v":"1101110010"},{"$f":"MID(TEXT(10^(6-NumLights),\"0\"),2,6-NumLights)","v":"0"},{"$f":"LEFT(Table_ShowIS[[#This Row],[InitDecString]],4+NumLights)&Table_ShowIS[[#This Row],[EndofDecString]]","v":"1101110010"},{"$f":"BIN2HEX(VALUE(MID(Table_ShowIS[[#This Row],[DecString]],1,2)))&BIN2HEX(VALUE(MID(Table_ShowIS[[#This Row],[DecString]],3,4)))&BIN2HEX(VALUE(MID(Table_ShowIS[[#This Row],[DecString]],7,4)))","v":"372"},null,{"$f":"TT!$O32","v":"Colorless"},1,null,1,1,{"$f":"IFERROR(MATCH(PatternColorTable[[#This Row],[P0Saved]],ColorPallete[Color],0),PatternColorTable[[#This Row],[P0Saved]])","v":1},2,3,5,1,2,4,3,3,3,3,1,1,5,4,5,1,2,3]
[null,{"$f":"BackendTable[[#This Row],[Pattern]]&\"_\"&BackendTable[[#This Row],[Combo]]","v":"P0_2"},"P0",2,2,1,0,0,1,1,0,1,{"$f":"DEC2BIN(BackendTable[[#This Row],[Intensity]],2)&DEC2BIN(BackendTable[[#This Row],[Speed]],2)&_xlfn.CONCAT(BackendTable[[#This Row],[Light1]:[Light6]])","v":"1001001101"},{"$f":"BIN2HEX(VALUE(MID(BackendTable[[#This Row],[DecString]],1,2)))&BIN2HEX(VALUE(MID(BackendTable[[#This Row],[DecString]],3,4)))&BIN2HEX(VALUE(MID(BackendTable[[#This Row],[DecString]],7,4)))","v":"24D"},{"$f":"BackendTable[[#This Row],[Intensity]]&\";\"&BackendTable[[#This Row],[Speed]]&\";\"&BackendTable[[#This Row],[Light1]]&\";\"&BackendTable[[#This Row],[Light2]]&\";\"&BackendTable[[#This Row],[Light3]]&\";\"&BackendTable[[#This Row],[Light4]]&\";\"&BackendTable[[#This Row],[Light5]]&\";\"&BackendTable[[#This Row],[Light6]]","v":"2;1;0;0;1;1;0;1"},{"$f":"BackendTable[[#This Row],[HexString]]","v":"24D"},null,"Lights",{"$f":"Dashboard!$F$7","v":5},null,null,2,{"$f":"INDEX(INDIRECT(\"BackendTable[\"&W$2&\"]\",0),MATCH(PatternSelect&\"_\"&RIGHT(Table_ShowIS[[#This Row],[Row]],1),BackendTable[LineID],0))","v":2},{"$f":"INDEX(INDIRECT(\"BackendTable[\"&X$2&\"]\",0),MATCH(PatternSelect&\"_\"&RIGHT(Table_ShowIS[[#This Row],[Row]],1),BackendTable[LineID],0))","v":1},{"$f":"INDEX(BackendTable[DecString],MATCH(PatternSelect&\"_\"&Table_ShowIS[[#This Row],[Row]],BackendTable[LineID],0))","v":"1001001101"},"0",{"$f":"LEFT(Table_ShowIS[[#This Row],[InitDecString]],4+NumLights)&Table_ShowIS[[#This Row],[EndofDecString]]","v":"1001001100"},{"$f":"BIN2HEX(VALUE(MID(Table_ShowIS[[#This Row],[DecString]],1,2)))&BIN2HEX(VALUE(MID(Table_ShowIS[[#This Row],[DecString]],3,4)))&BIN2HEX(VALUE(MID(Table_ShowIS[[#This Row],[DecString]],7,4)))","v":"24C"},null,{"$f":"TT!$O33","v":"Green"},2,null,2,3,{"$f":"IFERROR(MATCH(PatternColorTable[[#This Row],[P0Saved]],ColorPallete[Color],0),PatternColorTable[[#This Row],[P0Saved]])","v":3},1,1,1,4,3,5,4,4,4,5,5,3,4,2,5,3,4,4]
[null,{"$f":"BackendTable[[#This Row],[Pattern]]&\"_\"&BackendTable[[#This Row],[Combo]]","v":"P0_3"},"P0",3,1,3,1,1,1,1,1,1,{"$f":"DEC2BIN(BackendTable[[#This Row],[Intensity]],2)&DEC2BIN(BackendTable[[#This Row],[Speed]],2)&_xlfn.CONCAT(BackendTable[[#This Row],[Light1]:[Light6]])","v":"0111111111"},{"$f":"BIN2HEX(VALUE(MID(BackendTable[[#This Row],[DecString]],1,2)))&BIN2HEX(VALUE(MID(BackendTable[[#This Row],[DecString]],3,4)))&BIN2HEX(VALUE(MID(BackendTable[[#This Row],[DecString]],7,4)))","v":"1FF"},{"$f":"BackendTable[[#This Row],[Intensity]]&\";\"&BackendTable[[#This Row],[Speed]]&\";\"&BackendTable[[#This Row],[Light1]]&\";\"&BackendTable[[#This Row],[Light2]]&\";\"&BackendTable[[#This Row],[Light3]]&\";\"&BackendTable[[#This Row],[Light4]]&\";\"&BackendTable[[#This Row],[Light5]]&\";\"&BackendTable[[#This Row],[Light6]]","v":"1;3;1;1;1;1;1;1"},{"$f":"BackendTable[[#This Row],[HexString]]","v":"1FF"},null,"Pattern Select",{"$f":"IF(S3=0,\"P0\",S4&\"L_P\"&S3)","v":"P0"},null,null,3,{"$f":"INDEX(INDIRECT(\"BackendTable[\"&W$2&\"]\",0),MATCH(PatternSelect&\"_\"&RIGHT(Table_ShowIS[[#This Row],[Row]],1),BackendTable[LineID],0))","v":1},{"$f":"INDEX(INDIRECT(\"BackendTable[\"&X$2&\"]\",0),MATCH(PatternSelect&\"_\"&RIGHT(Table_ShowIS[[#This Row],[Row]],1),BackendTable[LineID],0))","v":3},{"$f":"INDEX(BackendTable[DecString],MATCH(PatternSelect&\"_\"&Table_ShowIS[[#This Row],[Row]],BackendTable[LineID],0))","v":"0111111111"},"0",{"$f":"LEFT(Table_ShowIS[[#This Row],[InitDecString]],4+NumLights)&Table_ShowIS[[#This Row],[EndofDecString]]","v":"0111111110"},{"$f":"BIN2HEX(VALUE(MID(Table_ShowIS[[#This Row],[DecString]],1,2)))&BIN2HEX(VALUE(MID(Table_ShowIS[[#This Row],[DecString]],3,4)))&BIN2HEX(VALUE(MID(Table_ShowIS[[#This Row],[DecString]],7,4)))","v":"1FE"},null,{"$f":"TT!$O34","v":"Red"},3,null,3,4,{"$f":"IFERROR(MATCH(PatternColorTable[[#This Row],[P0Saved]],ColorPallete[Color],0),PatternColorTable[[#This Row],[P0Saved]])","v":4},1,1,1,1,1,1,2,2,2,4,2,5,2,1,1,5,2,2]
[null,{"$f":"BackendTable[[#This Row],[Pattern]]&\"_\"&BackendTable[[#This Row],[Combo]]","v":"P0_4"},"P0",4,2,2,1,0,0,0,0,1,{"$f":"DEC2BIN(BackendTable[[#This Row],[Intensity]],2)&DEC2BIN(BackendTable[[#This Row],[Speed]],2)&_xlfn.CONCAT(BackendTable[[#This Row],[Light1]:[Light6]])","v":"1010100001"},{"$f":"BIN2HEX(VALUE(MID(BackendTable[[#This Row],[DecString]],1,2)))&BIN2HEX(VALUE(MID(BackendTable[[#This Row],[DecString]],3,4)))&BIN2HEX(VALUE(MID(BackendTable[[#This Row],[DecString]],7,4)))","v":"2A1"},{"$f":"BackendTable[[#This Row],[Intensity]]&\";\"&BackendTable[[#This Row],[Speed]]&\";\"&BackendTable[[#This Row],[Light1]]&\";\"&BackendTable[[#This Row],[Light2]]&\";\"&BackendTable[[#This Row],[Light3]]&\";\"&BackendTable[[#This Row],[Light4]]&\";\"&BackendTable[[#This Row],[Light5]]&\";\"&BackendTable[[#This Row],[Light6]]","v":"2;2;1;0;0;0;0;1"},{"$f":"BackendTable[[#This Row],[HexString]]","v":"2A1"},null,"Light Color 1",{"$f":"INDEX(ColorPallete[Color],INDEX(PatternColorTable[],MATCH(VALUE(RIGHT($R6,1)),PatternColorTable[Light],0),MATCH(PatternSelect,PatternColorTable[#Headers],0)))","v":"Colorless"},{"$f":"MATCH(ColorLight1,ColorPallete[Color],0)","v":1},null,4,{"$f":"INDEX(INDIRECT(\"BackendTable[\"&W$2&\"]\",0),MATCH(PatternSelect&\"_\"&RIGHT(Table_ShowIS[[#This Row],[Row]],1),BackendTable[LineID],0))","v":2},{"$f":"INDEX(INDIRECT(\"BackendTable[\"&X$2&\"]\",0),MATCH(PatternSelect&\"_\"&RIGHT(Table_ShowIS[[#This Row],[Row]],1),BackendTable[LineID],0))","v":2},{"$f":"INDEX(BackendTable[DecString],MATCH(PatternSelect&\"_\"&Table_ShowIS[[#This Row],[Row]],BackendTable[LineID],0))","v":"1010100001"},"0",{"$f":"LEFT(Table_ShowIS[[#This Row],[InitDecString]],4+NumLights)&Table_ShowIS[[#This Row],[EndofDecString]]","v":"1010100000"},{"$f":"BIN2HEX(VALUE(MID(Table_ShowIS[[#This Row],[DecString]],1,2)))&BIN2HEX(VALUE(MID(Table_ShowIS[[#This Row],[DecString]],3,4)))&BIN2HEX(VALUE(MID(Table_ShowIS[[#This Row],[DecString]],7,4)))","v":"2A0"},null,{"$f":"TT!$O35","v":"Yellow"},4,null,4,2,{"$f":"IFERROR(MATCH(PatternColorTable[[#This Row],[P0Saved]],ColorPallete[Color],0),PatternColorTable[[#This Row],[P0Saved]])","v":2},1,1,1,1,1,1,1,1,1,2,3,4,4,5,2,4,3,2]
[null,{"$f":"BackendTable[[#This Row],[Pattern]]&\"_\"&BackendTable[[#This Row],[Combo]]","v":"P0_5"},"P0",5,3,1,0,1,0,0,1,0,{"$f":"DEC2BIN(BackendTable[[#This Row],[Intensity]],2)&DEC2BIN(BackendTable[[#This Row],[Speed]],2)&_xlfn.CONCAT(BackendTable[[#This Row],[Light1]:[Light6]])","v":"1101010010"},{"$f":"BIN2HEX(VALUE(MID(BackendTable[[#This Row],[DecString]],1,2)))&BIN2HEX(VALUE(MID(BackendTable[[#This Row],[DecString]],3,4)))&BIN2HEX(VALUE(MID(BackendTable[[#This Row],[DecString]],7,4)))","v":"352"},{"$f":"BackendTable[[#This Row],[Intensity]]&\";\"&BackendTable[[#This Row],[Speed]]&\";\"&BackendTable[[#This Row],[Light1]]&\";\"&BackendTable[[#This Row],[Light2]]&\";\"&BackendTable[[#This Row],[Light3]]&\";\"&BackendTable[[#This Row],[Light4]]&\";\"&BackendTable[[#This Row],[Light5]]&\";\"&BackendTable[[#This Row],[Light6]]","v":"3;1;0;1;0;0;1;0"},{"$f":"BackendTable[[#This Row],[HexString]]","v":"352"},null,"Light Color 2",{"$f":"INDEX(ColorPallete[Color],INDEX(PatternColorTable[],MATCH(VALUE(RIGHT($R7,1)),PatternColorTable[Light],0),MATCH(PatternSelect,PatternColorTable[#Headers],0)))","v":"Red"},{"$f":"MATCH(ColorLight2,ColorPallete[Color],0)","v":3},null,5,{"$f":"INDEX(INDIRECT(\"BackendTable[\"&W$2&\"]\",0),MATCH(PatternSelect&\"_\"&RIGHT(Table_ShowIS[[#This Row],[Row]],1),BackendTable[LineID],0))","v":3},{"$f":"INDEX(INDIRECT(\"BackendTable[\"&X$2&\"]\",0),MATCH(PatternSelect&\"_\"&RIGHT(Table_ShowIS[[#This Row],[Row]],1),BackendTable[LineID],0))","v":1},{"$f":"INDEX(BackendTable[DecString],MATCH(PatternSelect&\"_\"&Table_ShowIS[[#This Row],[Row]],BackendTable[LineID],0))","v":"1101010010"},"0",{"$f":"LEFT(Table_ShowIS[[#This Row],[InitDecString]],4+NumLights)&Table_ShowIS[[#This Row],[EndofDecString]]","v":"1101010010"},{"$f":"BIN2HEX(VALUE(MID(Table_ShowIS[[#This Row],[DecString]],1,2)))&BIN2HEX(VALUE(MID(Table_ShowIS[[#This Row],[DecString]],3,4)))&BIN2HEX(VALUE(MID(Table_ShowIS[[#This Row],[DecString]],7,4)))","v":"352"},null,{"$f":"TT!$O36","v":"Blue"},5,null,5,3,{"$f":"IFERROR(MATCH(PatternColorTable[[#This Row],[P0Saved]],ColorPallete[Color],0),PatternColorTable[[#This Row],[P0Saved]])","v":3},1,1,1,1,1,1,1,1,1,1,1,1,3,5,4,1,5,4]
[null,{"$f":"BackendTable[[#This Row],[Pattern]]&\"_\"&BackendTable[[#This Row],[Combo]]","v":"P0_6"},"P0",6,2,2,0,0,1,1,0,0,{"$f":"DEC2BIN(BackendTable[[#This Row],[Intensity]],2)&DEC2BIN(BackendTable[[#This Row],[Speed]],2)&_xlfn.CONCAT(BackendTable[[#This Row],[Light1]:[Light6]])","v":"1010001100"},{"$f":"BIN2HEX(VALUE(MID(BackendTable[[#This Row],[DecString]],1,2)))&BIN2HEX(VALUE(MID(BackendTable[[#This Row],[DecString]],3,4)))&BIN2HEX(VALUE(MID(BackendTable[[#This Row],[DecString]],7,4)))","v":"28C"},{"$f":"BackendTable[[#This Row],[Intensity]]&\";\"&BackendTable[[#This Row],[Speed]]&\";\"&BackendTable[[#This Row],[Light1]]&\";\"&BackendTable[[#This Row],[Light2]]&\";\"&BackendTable[[#This Row],[Light3]]&\";\"&BackendTable[[#This Row],[Light4]]&\";\"&BackendTable[[#This Row],[Light5]]&\";\"&BackendTable[[#This Row],[Light6]]","v":"2;2;0;0;1;1;0;0"},{"$f":"BackendTable[[#This Row],[HexString]]","v":"28C"},null,"Light Color 3",{"$f":"INDEX(ColorPallete[Color],INDEX(PatternColorTable[],MATCH(VALUE(RIGHT($R8,1)),PatternColorTable[Light],0),MATCH(PatternSelect,PatternColorTable[#Headers],0)))","v":"Yellow"},{"$f":"MATCH(ColorLight3,ColorPallete[Color],0)","v":4},null,6,{"$f":"INDEX(INDIRECT(\"BackendTable[\"&W$2&\"]\",0),MATCH(PatternSelect&\"_\"&RIGHT(Table_ShowIS[[#This Row],[Row]],1),BackendTable[LineID],0))","v":2},{"$f":"INDEX(INDIRECT(\"BackendTable[\"&X$2&\"]\",0),MATCH(PatternSelect&\"_\"&RIGHT(Table_ShowIS[[#This Row],[Row]],1),BackendTable[LineID],0))","v":2},{"$f":"INDEX(BackendTable[DecString],MATCH(PatternSelect&\"_\"&Table_ShowIS[[#This Row],[Row]],BackendTable[LineID],0))","v":"1010001100"},"0",{"$f":"LEFT(Table_ShowIS[[#This Row],[InitDecString]],4+NumLights)&Table_ShowIS[[#This Row],[EndofDecString]]","v":"1010001100"},{"$f":"BIN2HEX(VALUE(MID(Table_ShowIS[[#This Row],[DecString]],1,2)))&BIN2HEX(VALUE(MID(Table_ShowIS[[#This Row],[DecString]],3,4)))&BIN2HEX(VALUE(MID(Table_ShowIS[[#This Row],[DecString]],7,4)))","v":"28C"},null,null,null,null,6,5,{"$f":"IFERROR(MATCH(PatternColorTable[[#This Row],[P0Saved]],ColorPallete[Color],0),PatternColorTable[[#This Row],[P0Saved]])","v":5},1,1,1,1,1,1,1,1,1,1,1,1,1,1,1,2,4,3]
{"$rows_left_out":147}
{"sheet":"Data In","index":4,"n_rows":22,"n_cols":12,"rows_kept":22,"cut":false,"hidden":false,"merged":[[0,0,0,9],[1,0,1,9],[2,0,2,10],[5,0,5,10]]}
[{"$f":"TT!O39","v":"Data In (From Source)"},null,null,null,null,null,null,null,null,null,"update"]
[{"$f":"TT!O40","v":"Data coming from the current data source will appear below as it is received."}]
[{"$f":"TT!O41","v":"Current Data"}]
[{"$f":"TT!O42","v":"Time"},"CH1","CH2","CH3","CH4","CH5","CH6","CH7","CH8","CH9","CH10"]
[]
[{"$f":"TT!O43","v":"Historical Data"}]
[{"$f":"IF(A4=\"\",\"\",A4)","v":"Time"},{"$f":"IF(B4=\"\",\"\",B4)","v":"CH1"},{"$f":"IF(C4=\"\",\"\",C4)","v":"CH2"},{"$f":"IF(D4=\"\",\"\",D4)","v":"CH3"},{"$f":"IF(E4=\"\",\"\",E4)","v":"CH4"},"CH5",{"$f":"IF(G4=\"\",\"\",G4)","v":"CH6"},{"$f":"IF(H4=\"\",\"\",H4)","v":"CH7"},{"$f":"IF(I4=\"\",\"\",I4)","v":"CH8"},{"$f":"IF(J4=\"\",\"\",J4)","v":"CH9"},{"$f":"IF(K4=\"\",\"\",K4)","v":"CH10"}]
[]
{"$rows_left_out":15}
{"sheet":"Data Out","index":5,"n_rows":5,"n_cols":11,"rows_kept":5,"cut":false,"hidden":false,"merged":[[0,0,0,9],[1,0,1,9]]}
[{"$f":"TT!O45","v":"Data Out (To Device)"},null,null,null,null,null,null,null,null,null,"update"]
[{"$f":"TT!O46","v":"Data entered into the channels below will be sent to the currently connected device as a comma-delimited string."}]
[]
[{"$f":"TT!$O$47","v":"Command"},{"$f":"TT!$O$16","v":"Loop"},{"$f":"TT!$O48","v":"ActionR1"},{"$f":"TT!$O49","v":"ActionR2"},{"$f":"TT!$O50","v":"ActionR3"},{"$f":"TT!$O51","v":"ActionR4"},{"$f":"TT!$O52","v":"ActionR5"},{"$f":"TT!$O53","v":"ActionR6"},{"$f":"TT!$O54","v":"ActionR7"},{"$f":"TT!$O55","v":"ActionR8"}]
[{"$f":"Backend!S20","v":"#pause"},{"$f":"Backend!S21","v":0},{"$f":"IF(CommandCell=\"#pause\",140,INDEX(Table_ShowIS[HexString],MATCH(VALUE(RIGHT('Data Out'!C$4,1)),Table_ShowIS[Row],0)))","v":140},{"$f":"IF(CommandCell=\"#pause\",140,INDEX(Table_ShowIS[HexString],MATCH(VALUE(RIGHT('Data Out'!D$4,1)),Table_ShowIS[Row],0)))","v":140},{"$f":"IF(CommandCell=\"#pause\",140,INDEX(Table_ShowIS[HexString],MATCH(VALUE(RIGHT('Data Out'!E$4,1)),Table_ShowIS[Row],0)))","v":140},{"$f":"IF(CommandCell=\"#pause\",140,INDEX(Table_ShowIS[HexString],MATCH(VALUE(RIGHT('Data Out'!F$4,1)),Table_ShowIS[Row],0)))","v":140},{"$f":"IF(CommandCell=\"#pause\",140,INDEX(Table_ShowIS[HexString],MATCH(VALUE(RIGHT('Data Out'!G$4,1)),Table_ShowIS[Row],0)))","v":140},{"$f":"IF(CommandCell=\"#pause\",140,INDEX(Table_ShowIS[HexString],MATCH(VALUE(RIGHT('Data Out'!H$4,1)),Table_ShowIS[Row],0)))","v":140},{"$f":"IF(CommandCell=\"#pause\",140,INDEX(Table_ShowIS[HexString],MATCH(VALUE(RIGHT('Data Out'!I$4,1)),Table_ShowIS[Row],0)))","v":140},{"$f":"IF(CommandCell=\"#pause\",140,INDEX(Table_ShowIS[HexString],MATCH(VALUE(RIGHT('Data Out'!J$4,1)),Table_ShowIS[Row],0)))","v":140}]

{"sheet":"Settings","index":6,"n_rows":12,"n_cols":8,"rows_kept":12,"cut":false,"hidden":false,"merged":[[0,0,0,6],[1,0,1,6],[11,0,11,6]]}
[{"$f":"TT!O56","v":"Workbook Settings"},null,null,null,null,null,null,"update"]
[{"$f":"TT!O57","v":"Settings below will affect how data is read into the current workbook from data sources. Clear a field's contents to revert to its default setting."}]
[]
[{"$f":"TT!O58","v":"Data interval (ms):"},"150",10]
[]
[{"$f":"TT!O59","v":"Data rows:"},"15",15]
[]
[{"$f":"TT!O60","v":"Data channels:"},"10"]
{"$rows_left_out":4}